Reaction Details
TargetNuclear receptor ROR-gamma
LigandBDBM50005415
Substrate/Competitorn/a
Meas. Tech.ChEMBL_1338694 (CHEMBL3242032)
IC50 100±n/a nM
Citation Zhang, YXue, XJin, XSong, YLi, JLuo, XSong, MYan, WSong, HXu, Y Discovery of 2-oxo-1,2-dihydrobenzo[cd]indole-6-sulfonamide derivatives as new ROR¿ inhibitors using virtual screening, synthesis and biological evaluation. Eur J Med Chem78:431-41 (2014) 
 
Nuclear receptor ROR-gamma
Name:Nuclear receptor ROR-gamma
Type:Enzyme Catalytic Domain
Mol. Mass.:58218.40
Organism:Homo sapiens (Human)
Description:P51449
Residue:518
BDBM50005415
NameBDBM50005415
Synonyms:CHEMBL142035 | CHEMBL3234030
TypeSmall organic molecule
Emp. Form.C22H17N3O3S
Mol. Mass.403.454
SMILESCCN1C(=O)c2cccc3c(ccc1c23)S(=O)(=O)Nc1cccc2ccncc12