Reaction Details
TargetNuclear receptor ROR-gamma
LigandBDBM50005477
Substrate/Competitorn/a
Meas. Tech.ChEMBL_1338694 (CHEMBL3242032)
IC50 380±n/a nM
Citation Zhang, YXue, XJin, XSong, YLi, JLuo, XSong, MYan, WSong, HXu, Y Discovery of 2-oxo-1,2-dihydrobenzo[cd]indole-6-sulfonamide derivatives as new ROR¿ inhibitors using virtual screening, synthesis and biological evaluation. Eur J Med Chem78:431-41 (2014) 
 
Nuclear receptor ROR-gamma
Name:Nuclear receptor ROR-gamma
Type:Enzyme Catalytic Domain
Mol. Mass.:58218.40
Organism:Homo sapiens (Human)
Description:P51449
Residue:518
BDBM50005477
NameBDBM50005477
Synonyms:CHEMBL140546 | CHEMBL3234248
TypeSmall organic molecule
Emp. Form.C25H19N3O5S
Mol. Mass.473.5
SMILESCOc1ccc(NC(=O)c2ccc(NS(=O)(=O)c3ccc4NC(=O)c5cccc3c45)cc2)cc1