Reaction Details
TargetNuclear receptor ROR-gamma
LigandBDBM50005485
Substrate/Competitorn/a
Meas. Tech.ChEMBL_1338694 (CHEMBL3242032)
IC50 320±n/a nM
Citation Zhang, YXue, XJin, XSong, YLi, JLuo, XSong, MYan, WSong, HXu, Y Discovery of 2-oxo-1,2-dihydrobenzo[cd]indole-6-sulfonamide derivatives as new ROR¿ inhibitors using virtual screening, synthesis and biological evaluation. Eur J Med Chem78:431-41 (2014) 
 
Nuclear receptor ROR-gamma
Name:Nuclear receptor ROR-gamma
Type:Enzyme Catalytic Domain
Mol. Mass.:58218.40
Organism:Homo sapiens (Human)
Description:P51449
Residue:518
BDBM50005485
NameBDBM50005485
Synonyms:CHEMBL140836 | CHEMBL3234256
TypeSmall organic molecule
Emp. Form.C21H19N3O4S
Mol. Mass.409.458
SMILESCCN1C(=O)c2cccc3c(ccc1c23)S(=O)(=O)Nc1ccc(NC(C)=O)cc1