Reaction Details
TargetNuclear receptor ROR-gamma
LigandBDBM50005412
Substrate/Competitorn/a
Meas. Tech.ChEMBL_1338695 (CHEMBL3242033)
IC50 1350±n/a nM
Citation Zhang, YXue, XJin, XSong, YLi, JLuo, XSong, MYan, WSong, HXu, Y Discovery of 2-oxo-1,2-dihydrobenzo[cd]indole-6-sulfonamide derivatives as new ROR¿ inhibitors using virtual screening, synthesis and biological evaluation. Eur J Med Chem78:431-41 (2014) 
 
Nuclear receptor ROR-gamma
Name:Nuclear receptor ROR-gamma
Type:Enzyme Catalytic Domain
Mol. Mass.:58218.40
Organism:Homo sapiens (Human)
Description:P51449
Residue:518
BDBM50005412
NameBDBM50005412
Synonyms:CHEMBL138563 | CHEMBL3234025
TypeSmall organic molecule
Emp. Form.C22H19N3O4S2
Mol. Mass.453.534
SMILESCCOc1ccc2nc(NS(=O)(=O)c3ccc4N(CC)C(=O)c5cccc3c45)sc2c1