Reaction Details
TargetNuclear receptor ROR-gamma
LigandBDBM50005479
Substrate/Competitorn/a
Meas. Tech.ChEMBL_1338695 (CHEMBL3242033)
IC50 3390±n/a nM
Citation Zhang, YXue, XJin, XSong, YLi, JLuo, XSong, MYan, WSong, HXu, Y Discovery of 2-oxo-1,2-dihydrobenzo[cd]indole-6-sulfonamide derivatives as new ROR¿ inhibitors using virtual screening, synthesis and biological evaluation. Eur J Med Chem78:431-41 (2014) 
 
Nuclear receptor ROR-gamma
Name:Nuclear receptor ROR-gamma
Type:Enzyme Catalytic Domain
Mol. Mass.:58218.40
Organism:Homo sapiens (Human)
Description:P51449
Residue:518
BDBM50005479
NameBDBM50005479
Synonyms:CHEMBL3234249 | SAVIPRAZOLE
TypeSmall organic molecule
Emp. Form.C24H25N3O5S
Mol. Mass.467.537
SMILESCCN1C(=O)c2cccc3c(ccc1c23)S(=O)(=O)Nc1cccc(NC(=O)OC(C)(C)C)c1