Reaction Details
TargetNuclear receptor ROR-gamma
LigandBDBM50005482
Substrate/Competitorn/a
Meas. Tech.ChEMBL_1338695 (CHEMBL3242033)
IC50 90±n/a nM
Citation Zhang, YXue, XJin, XSong, YLi, JLuo, XSong, MYan, WSong, HXu, Y Discovery of 2-oxo-1,2-dihydrobenzo[cd]indole-6-sulfonamide derivatives as new ROR¿ inhibitors using virtual screening, synthesis and biological evaluation. Eur J Med Chem78:431-41 (2014) 
 
Nuclear receptor ROR-gamma
Name:Nuclear receptor ROR-gamma
Type:Enzyme Catalytic Domain
Mol. Mass.:58218.40
Organism:Homo sapiens (Human)
Description:P51449
Residue:518
BDBM50005482
NameBDBM50005482
Synonyms:CHEMBL140772 | CHEMBL3234252
TypeSmall organic molecule
Emp. Form.C20H23N3O4S
Mol. Mass.401.479
SMILESCCN1C(=O)c2cccc3c(ccc1c23)S(=O)(=O)NC1CCN(CC1)C(C)=O