Reaction Details
TargetNuclear receptor ROR-gamma
LigandBDBM19993
Substrate/Competitorn/a
Meas. Tech.ChEMBL_1338698 (CHEMBL3242036)
IC50 2010±n/a nM
Citation Zhang, YXue, XJin, XSong, YLi, JLuo, XSong, MYan, WSong, HXu, Y Discovery of 2-oxo-1,2-dihydrobenzo[cd]indole-6-sulfonamide derivatives as new ROR¿ inhibitors using virtual screening, synthesis and biological evaluation. Eur J Med Chem78:431-41 (2014) 
 
Nuclear receptor ROR-gamma
Name:Nuclear receptor ROR-gamma
Type:Enzyme Catalytic Domain
Mol. Mass.:58218.40
Organism:Homo sapiens (Human)
Description:P51449
Residue:518
BDBM19993
NameBDBM19993
Synonyms:CHEMBL62136 T 0901317 TO-901317 US10669296, Compound TO901317 [3H]T0901317
TypeSmall organic molecule
Emp. Form.C17H12F9NO3S
Mol. Mass.481.333
SMILESOC(c1ccc(cc1)N(CC(F)(F)F)S(=O)(=O)c1ccccc1)(C(F)(F)F)C(F)(F)F