Reaction Details
TargetHistone deacetylase 6
LigandBDBM50005730
Substrate/Competitorn/a
Meas. Tech.ChEMBL_1335256 (CHEMBL3238609)
IC50 409±n/a nM
Citation Cincinelli, RMusso, LGiannini, GZuco, VDe Cesare, MZunino, FDallavalle, S Influence of the adamantyl moiety on the activity of biphenylacrylohydroxamic acid-based HDAC inhibitors. Eur J Med Chem79:251-9 (2014) 
 
Histone deacetylase 6
Name:Histone deacetylase 6
Type:Chromatin regulator; hydrolase; repressor
Mol. Mass.:131381.51
Organism:Homo sapiens (Human)
Description:Q9UBN7
Residue:1215
BDBM50005730
NameBDBM50005730
Synonyms:CHEMBL3235790
TypeSmall organic molecule
Emp. Form.C27H27ClN2O2
Mol. Mass.446.968
SMILESONC(=O)\C=C\c1ccc(c(Cl)c1)-c1ccc(CC#N)c(c1)C12CC3CC(CC(C3)C1)C2