Reaction Details
TargetHistone deacetylase 6
LigandBDBM50293358
Substrate/Competitorn/a
Meas. Tech.ChEMBL_1335256 (CHEMBL3238609)
IC50 42±n/a nM
Citation Cincinelli, RMusso, LGiannini, GZuco, VDe Cesare, MZunino, FDallavalle, S Influence of the adamantyl moiety on the activity of biphenylacrylohydroxamic acid-based HDAC inhibitors. Eur J Med Chem79:251-9 (2014) 
 
Histone deacetylase 6
Name:Histone deacetylase 6
Type:Chromatin regulator; hydrolase; repressor
Mol. Mass.:131381.51
Organism:Homo sapiens (Human)
Description:Q9UBN7
Residue:1215
BDBM50293358
NameBDBM50293358
Synonyms:CHEMBL556332 | N-Hydroxy-E-3-(4'-hydroxybiphenyl-4-yl)-acrylamide
TypeSmall organic molecule
Emp. Form.C15H13NO3
Mol. Mass.255.2686
SMILESONC(=O)\C=C\c1ccc(cc1)-c1ccc(O)cc1