Reaction Details
TargetHistone deacetylase 1
LigandBDBM50005730
Substrate/Competitorn/a
Meas. Tech.ChEMBL_1335252 (CHEMBL3238605)
IC50 49000±n/a nM
Citation Cincinelli, RMusso, LGiannini, GZuco, VDe Cesare, MZunino, FDallavalle, S Influence of the adamantyl moiety on the activity of biphenylacrylohydroxamic acid-based HDAC inhibitors. Eur J Med Chem79:251-9 (2014) 
 
Histone deacetylase 1
Name:Histone deacetylase 1
Type:Enzyme
Mol. Mass.:55090.27
Organism:Homo sapiens (Human)
Description:Q13547
Residue:482
BDBM50005730
NameBDBM50005730
Synonyms:CHEMBL3235790
TypeSmall organic molecule
Emp. Form.C27H27ClN2O2
Mol. Mass.446.968
SMILESONC(=O)\C=C\c1ccc(c(Cl)c1)-c1ccc(CC#N)c(c1)C12CC3CC(CC(C3)C1)C2