Reaction Details
TargetHistone deacetylase 3
LigandBDBM50005744
Substrate/Competitorn/a
Meas. Tech.ChEMBL_1335253 (CHEMBL3238606)
IC50 56000±n/a nM
Citation Cincinelli, RMusso, LGiannini, GZuco, VDe Cesare, MZunino, FDallavalle, S Influence of the adamantyl moiety on the activity of biphenylacrylohydroxamic acid-based HDAC inhibitors. Eur J Med Chem79:251-9 (2014) 
 
Histone deacetylase 3
Name:Histone deacetylase 3
Type:Enzyme
Mol. Mass.:48829.55
Organism:Homo sapiens (Human)
Description:O15379
Residue:428
BDBM50005744
NameBDBM50005744
Synonyms:CHEMBL3235463
TypeSmall organic molecule
Emp. Form.C25H27NO3
Mol. Mass.389.4868
SMILESONC(=O)\C=C\c1ccc(cc1)-c1ccc(O)c(c1)C12CC3CC(CC(C3)C1)C2