Reaction Details
TargetHistone deacetylase 2
LigandBDBM50005747
Substrate/Competitorn/a
Meas. Tech.ChEMBL_1335247 (CHEMBL3238600)
IC50>10000±n/a nM
Citation Cincinelli, RMusso, LGiannini, GZuco, VDe Cesare, MZunino, FDallavalle, S Influence of the adamantyl moiety on the activity of biphenylacrylohydroxamic acid-based HDAC inhibitors. Eur J Med Chem79:251-9 (2014) 
 
Histone deacetylase 2
Name:Histone deacetylase 2
Type:Chromatin regulator; hydrolase; repressor
Mol. Mass.:55356.54
Organism:Homo sapiens (Human)
Description:Q92769
Residue:488
BDBM50005747
NameBDBM50005747
Synonyms:CHEMBL3235462
TypeSmall organic molecule
Emp. Form.C25H27NO2
Mol. Mass.373.4874
SMILESONC(=O)\C=C\c1ccc(cc1)-c1cccc(c1)C12CC3CC(CC(C3)C1)C2