Reaction Details
TargetHistone deacetylase 8
LigandBDBM50293358
Substrate/Competitorn/a
Meas. Tech.ChEMBL_1335258 (CHEMBL3238611)
IC50 160±n/a nM
Citation Cincinelli, RMusso, LGiannini, GZuco, VDe Cesare, MZunino, FDallavalle, S Influence of the adamantyl moiety on the activity of biphenylacrylohydroxamic acid-based HDAC inhibitors. Eur J Med Chem79:251-9 (2014) 
 
Histone deacetylase 8
Name:Histone deacetylase 8
Type:Enzyme
Mol. Mass.:41749.60
Organism:Homo sapiens (Human)
Description:Q9BY41
Residue:377
BDBM50293358
NameBDBM50293358
Synonyms:CHEMBL556332 | N-Hydroxy-E-3-(4'-hydroxybiphenyl-4-yl)-acrylamide
TypeSmall organic molecule
Emp. Form.C15H13NO3
Mol. Mass.255.2686
SMILESONC(=O)\C=C\c1ccc(cc1)-c1ccc(O)cc1