Reaction Details
TargetProlyl endopeptidase
LigandBDBM50005872
Substrate/Competitorn/a
Meas. Tech.ChEMBL_1336166 (CHEMBL3241126)
Ki 22±n/a nM
Citation Kallinen, ATodorov, BKallionpää, RBäck, SSarparanta, MRaki, MGarcía-Horsman, JABergström, KAWallén, EAMännistö, PTAiraksinen, AJ Synthesis and biological evaluation of novel (123)I-labeled 4-(4-iodophenyl)butanoyl-L-prolyl-(2S)-pyrrolidines for imaging prolyl oligopeptidase in vivo. Eur J Med Chem79:436-45 (2014) 
 
Prolyl endopeptidase
Name:Prolyl endopeptidase
Type:n/a
Mol. Mass.:80758.04
Organism:Sus scrofa
Description:n/a
Residue:710
BDBM50005872
NameBDBM50005872
Synonyms:CHEMBL3236272
TypeSmall organic molecule
Emp. Form.C19H25IN2O2
Mol. Mass.440.3185
SMILESIc1ccc(CCCC(=O)N2CCC[C@H]2C(=O)N2CCCC2)cc1