Reaction Details
TargetCannabinoid receptor 2
LigandBDBM50072769
Substrate/Competitorn/a
Meas. Tech.ChEMBL_1334653 (CHEMBL3239853)
Ki>2000±n/a nM
Citation Han, SThatte, JBuzard, DJJones, RM Therapeutic utility of cannabinoid receptor type 2 (CB(2)) selective agonists. Cell Chem Biol56:8224-56 (2013) 
 
Cannabinoid receptor 2
Name:Cannabinoid receptor 2
Type:Enzyme
Mol. Mass.:39366.68
Organism:Rattus norvegicus (Rat)
Description:Q9QZN9
Residue:360
BDBM50072769
NameBDBM50072769
Synonyms:(5Z,8Z,11Z,14Z)-Icosa-5,8,11,14-tetraenoic acid (2-chloro-ethyl)-amide CHEMBL151167 | N-(2-chloroethyl)icosa-5,8,11,14-tetraenamide
TypeSmall organic molecule
Emp. Form.C22H36ClNO
Mol. Mass.365.98
SMILESCCCCC\C=C/C\C=C/C\C=C/C\C=C/CCCC(=O)NCCCl