Reaction Details
TargetCannabinoid receptor 2
LigandBDBM50171296
Substrate/Competitorn/a
Meas. Tech.ChEMBL_1334623 (CHEMBL3239823)
Ki 3000±n/a nM
Citation Han, SThatte, JBuzard, DJJones, RM Therapeutic utility of cannabinoid receptor type 2 (CB(2)) selective agonists. Cell Chem Biol56:8224-56 (2013) 
 
Cannabinoid receptor 2
Name:Cannabinoid receptor 2
Type:G Protein-Coupled Receptor (GPCR)
Mol. Mass.:39690.94
Organism:Homo sapiens (Human)
Description:P34972
Residue:360
BDBM50171296
NameBDBM50171296
Synonyms:2-[((11Z,14Z)-Icosa-5,8,11,14-tetraenyl)oxy]-propane-1,3-diol 2-[(5Z,8Z,11Z,14Z)-icosa-5,8,11,14-tetraenyloxy]propane-1,3-diol HU-310
TypeSmall organic molecule
Emp. Form.C23H40O3
Mol. Mass.364.5619
SMILESCCCCC\C=C/C\C=C/C\C=C/C\C=C/CCCCOC(CO)CO