Reaction Details
TargetCannabinoid receptor 1
LigandBDBM50005923
Substrate/Competitorn/a
Meas. Tech.ChEMBL_1334625 (CHEMBL3239825)
Ki>10000±n/a nM
Citation Han, SThatte, JBuzard, DJJones, RM Therapeutic utility of cannabinoid receptor type 2 (CB(2)) selective agonists. Cell Chem Biol56:8224-56 (2013) 
 
Cannabinoid receptor 1
Name:Cannabinoid receptor 1
Type:G Protein-Coupled Receptor (GPCR)
Mol. Mass.:52856.55
Organism:Rattus norvegicus (rat)
Description:P20272
Residue:473
BDBM50005923
NameBDBM50005923
Synonyms:CHEMBL3233405
TypeSmall organic molecule
Emp. Form.C21H30O
Mol. Mass.298.4623
SMILES[H][C@@]12CC(C)=CC[C@@]1([H])C(C)(C)Oc1cc(CCCCC)ccc21