Reaction Details
TargetCannabinoid receptor 1
LigandBDBM21283
Substrate/Competitorn/a
Meas. Tech.ChEMBL_1334639 (CHEMBL3239839)
Ki 580±n/a nM
Citation Han, SThatte, JBuzard, DJJones, RM Therapeutic utility of cannabinoid receptor type 2 (CB(2)) selective agonists. Cell Chem Biol56:8224-56 (2013) 
 
Cannabinoid receptor 1
Name:Cannabinoid receptor 1
Type:G Protein-Coupled Receptor (GPCR)
Mol. Mass.:52868.96
Organism:Homo sapiens (Human)
Description:P21554
Residue:472
BDBM21283
NameBDBM21283
Synonyms:3-[(2-iodo-5-nitrophenyl)carbonyl]-1-[(1-methylpiperidin-2-yl)methyl]-1H-indole | AM1241
TypeSmall organic molecule
Emp. Form.C22H22IN3O3
Mol. Mass.503.3329
SMILESCN1CCCCC1Cn1cc(C(=O)c2cc(ccc2I)[N+]([O-])=O)c2ccccc12