Reaction Details
TargetCannabinoid receptor 2
LigandBDBM50006242
Substrate/Competitorn/a
Meas. Tech.ChEMBL_1334806 (CHEMBL3238913)
EC50<100±n/a nM
Citation Han, SThatte, JBuzard, DJJones, RM Therapeutic utility of cannabinoid receptor type 2 (CB(2)) selective agonists. Cell Chem Biol56:8224-56 (2013) 
 
Cannabinoid receptor 2
Name:Cannabinoid receptor 2
Type:G Protein-Coupled Receptor (GPCR)
Mol. Mass.:39690.94
Organism:Homo sapiens (Human)
Description:P34972
Residue:360
BDBM50006242
NameBDBM50006242
Synonyms:CHEMBL3234696
TypeSmall organic molecule
Emp. Form.C22H24N2OS
Mol. Mass.364.504
SMILESCCCn1c(C)c(C(=O)c2cc3ccsc3n2CCC)c2ccccc12