Reaction Details
TargetCannabinoid receptor 1
LigandBDBM50006249
Substrate/Competitorn/a
Meas. Tech.ChEMBL_1334807 (CHEMBL3238914)
EC50>100000±n/a nM
Citation Han, SThatte, JBuzard, DJJones, RM Therapeutic utility of cannabinoid receptor type 2 (CB(2)) selective agonists. Cell Chem Biol56:8224-56 (2013) 
 
Cannabinoid receptor 1
Name:Cannabinoid receptor 1
Type:G Protein-Coupled Receptor (GPCR)
Mol. Mass.:52868.96
Organism:Homo sapiens (Human)
Description:P21554
Residue:472
BDBM50006249
NameBDBM50006249
Synonyms:CHEMBL3234686
TypeSmall organic molecule
Emp. Form.C20H25ClN6O
Mol. Mass.400.905
SMILESCC(CO)n1c(nc2c(nc(C)nc12)N1CCN(C)CC1)-c1ccccc1Cl