Reaction Details
TargetCannabinoid receptor 1
LigandBDBM50006250
Substrate/Competitorn/a
Meas. Tech.ChEMBL_1334807 (CHEMBL3238914)
EC50>100000±n/a nM
Citation Han, SThatte, JBuzard, DJJones, RM Therapeutic utility of cannabinoid receptor type 2 (CB(2)) selective agonists. Cell Chem Biol56:8224-56 (2013) 
 
Cannabinoid receptor 1
Name:Cannabinoid receptor 1
Type:G Protein-Coupled Receptor (GPCR)
Mol. Mass.:52868.96
Organism:Homo sapiens (Human)
Description:P21554
Residue:472
BDBM50006250
NameBDBM50006250
Synonyms:CHEMBL3139186
TypeSmall organic molecule
Emp. Form.C22H27ClN6O
Mol. Mass.426.942
SMILESCN1CCN(CC1)c1nc(C)nc2n(C3CCOCC3)c(nc12)-c1ccccc1Cl