Reaction Details
TargetCannabinoid receptor 2
LigandBDBM50006251
Substrate/Competitorn/a
Meas. Tech.ChEMBL_1334808 (CHEMBL3238915)
EC50<100±n/a nM
Citation Han, SThatte, JBuzard, DJJones, RM Therapeutic utility of cannabinoid receptor type 2 (CB(2)) selective agonists. Cell Chem Biol56:8224-56 (2013) 
 
Cannabinoid receptor 2
Name:Cannabinoid receptor 2
Type:G Protein-Coupled Receptor (GPCR)
Mol. Mass.:39690.94
Organism:Homo sapiens (Human)
Description:P34972
Residue:360
BDBM50006251
NameBDBM50006251
Synonyms:CHEMBL3234687
TypeSmall organic molecule
Emp. Form.C20H23ClN2O3S
Mol. Mass.406.926
SMILESCS(=O)(=O)N1CCc2c(C1)cc(-c1cccc(Cl)c1)c(=O)n2CC1CCC1