Reaction Details
TargetCannabinoid receptor 1
LigandBDBM50006254
Substrate/Competitorn/a
Meas. Tech.ChEMBL_1334622 (CHEMBL3239822)
Ki 334±n/a nM
Citation Han, SThatte, JBuzard, DJJones, RM Therapeutic utility of cannabinoid receptor type 2 (CB(2)) selective agonists. Cell Chem Biol56:8224-56 (2013) 
 
Cannabinoid receptor 1
Name:Cannabinoid receptor 1
Type:G Protein-Coupled Receptor (GPCR)
Mol. Mass.:52868.96
Organism:Homo sapiens (Human)
Description:P21554
Residue:472
BDBM50006254
NameBDBM50006254
Synonyms:CHEMBL3234035
TypeSmall organic molecule
Emp. Form.C28H38O6
Mol. Mass.470.5977
SMILES[H][C@]12C[C@]([H])(C(=O)C[C@@H]1c1c(O)cc(cc1OC(=O)\C=C\C(O)=O)C(C)(C)CCCCCC)C2(C)C