Reaction Details
TargetCannabinoid receptor 2
LigandBDBM50335938
Substrate/Competitorn/a
Meas. Tech.ChEMBL_1334815 (CHEMBL3238922)
Ki 422±n/a nM
Citation Han, SThatte, JBuzard, DJJones, RM Therapeutic utility of cannabinoid receptor type 2 (CB(2)) selective agonists. Cell Chem Biol56:8224-56 (2013) 
 
Cannabinoid receptor 2
Name:Cannabinoid receptor 2
Type:G Protein-Coupled Receptor (GPCR)
Mol. Mass.:39690.94
Organism:Homo sapiens (Human)
Description:P34972
Residue:360
BDBM50335938
NameBDBM50335938
Synonyms:(3-benzyl-3-methyl-2,3-dihydrobenzofuran-6-yl)(piperidin-1-yl)methanone US9339486, 3
TypeSmall organic molecule
Emp. Form.C22H25NO2
Mol. Mass.335.4394
SMILESCC1(Cc2ccccc2)COc2cc(ccc12)C(=O)N1CCCCC1