Reaction Details
TargetCannabinoid receptor 2
LigandBDBM50006257
Substrate/Competitorn/a
Meas. Tech.ChEMBL_1334623 (CHEMBL3239823)
Ki 0.032000±n/a nM
Citation Han, SThatte, JBuzard, DJJones, RM Therapeutic utility of cannabinoid receptor type 2 (CB(2)) selective agonists. Cell Chem Biol56:8224-56 (2013) 
 
Cannabinoid receptor 2
Name:Cannabinoid receptor 2
Type:G Protein-Coupled Receptor (GPCR)
Mol. Mass.:39690.94
Organism:Homo sapiens (Human)
Description:P34972
Residue:360
BDBM50006257
NameBDBM50006257
Synonyms:CHEMBL3233404
TypeSmall organic molecule
Emp. Form.C24H36O4
Mol. Mass.388.5402
SMILES[H][C@@]12CC(OO)=CC[C@@]1([H])C(C)(C)Oc1cc(cc(O)c21)C(C)(C)CCCCCC