Reaction Details
TargetCannabinoid receptor 2
LigandBDBM50006262
Substrate/Competitorn/a
Meas. Tech.ChEMBL_1334808 (CHEMBL3238915)
EC50 0.560000±n/a nM
Citation Han, SThatte, JBuzard, DJJones, RM Therapeutic utility of cannabinoid receptor type 2 (CB(2)) selective agonists. Cell Chem Biol56:8224-56 (2013) 
 
Cannabinoid receptor 2
Name:Cannabinoid receptor 2
Type:G Protein-Coupled Receptor (GPCR)
Mol. Mass.:39690.94
Organism:Homo sapiens (Human)
Description:P34972
Residue:360
BDBM50006262
NameBDBM50006262
Synonyms:CHEMBL3234709
TypeSmall organic molecule
Emp. Form.C24H28N2O3S
Mol. Mass.424.556
SMILESO=S(=O)(N1CCOCC1)c1ccc2NC(C3C4CCC(C4)C3c2c1)c1ccccc1