Reaction Details
TargetCannabinoid receptor 2
LigandBDBM50006265
Substrate/Competitorn/a
Meas. Tech.ChEMBL_1334657 (CHEMBL3239857)
Ki 0.710000±n/a nM
Citation Han, SThatte, JBuzard, DJJones, RM Therapeutic utility of cannabinoid receptor type 2 (CB(2)) selective agonists. Cell Chem Biol56:8224-56 (2013) 
 
Cannabinoid receptor 2
Name:Cannabinoid receptor 2
Type:G Protein-Coupled Receptor (GPCR)
Mol. Mass.:39690.94
Organism:Homo sapiens (Human)
Description:P34972
Residue:360
BDBM50006265
NameBDBM50006265
Synonyms:CHEMBL3234672
TypeSmall organic molecule
Emp. Form.C21H18ClN3O
Mol. Mass.363.84
SMILESCC1(C)Cc2ccc(cc2[C@@H]1NC(=O)c1cc2cc(Cl)ccc2[nH]1)C#N