Reaction Details
TargetCannabinoid receptor 2
LigandBDBM50006266
Substrate/Competitorn/a
Meas. Tech.ChEMBL_1334786 (CHEMBL3238893)
EC50 0.910000±n/a nM
Citation Han, SThatte, JBuzard, DJJones, RM Therapeutic utility of cannabinoid receptor type 2 (CB(2)) selective agonists. Cell Chem Biol56:8224-56 (2013) 
 
Cannabinoid receptor 2
Name:Cannabinoid receptor 2
Type:G Protein-Coupled Receptor (GPCR)
Mol. Mass.:39690.94
Organism:Homo sapiens (Human)
Description:P34972
Residue:360
BDBM50006266
NameBDBM50006266
Synonyms:CHEMBL3234673
TypeSmall organic molecule
Emp. Form.C20H29N3O3S
Mol. Mass.391.528
SMILESCC(C)(C)Cc1nc2cc(ccc2n1CC1CC1)S(=O)(=O)C(C)(C)C(N)=O