Reaction Details
TargetCannabinoid receptor 2
LigandBDBM50006336
Substrate/Competitorn/a
Meas. Tech.ChEMBL_1334786 (CHEMBL3238893)
EC50 2.0±n/a nM
Citation Han, SThatte, JBuzard, DJJones, RM Therapeutic utility of cannabinoid receptor type 2 (CB(2)) selective agonists. Cell Chem Biol56:8224-56 (2013) 
 
Cannabinoid receptor 2
Name:Cannabinoid receptor 2
Type:G Protein-Coupled Receptor (GPCR)
Mol. Mass.:39690.94
Organism:Homo sapiens (Human)
Description:P34972
Residue:360
BDBM50006336
NameBDBM50006336
Synonyms:CHEMBL3235054
TypeSmall organic molecule
Emp. Form.C18H22N2O5S
Mol. Mass.378.443
SMILESCC1CN1S(=O)(=O)c1ccc2N(CC3CC3)C(=O)C3(OCCCO3)c2c1