Reaction Details
TargetCannabinoid receptor 1
LigandBDBM50006442
Substrate/Competitorn/a
Meas. Tech.ChEMBL_1334636 (CHEMBL3239836)
Ki 2.9±n/a nM
Citation Han, SThatte, JBuzard, DJJones, RM Therapeutic utility of cannabinoid receptor type 2 (CB(2)) selective agonists. Cell Chem Biol56:8224-56 (2013) 
 
Cannabinoid receptor 1
Name:Cannabinoid receptor 1
Type:G Protein-Coupled Receptor (GPCR)
Mol. Mass.:52856.55
Organism:Rattus norvegicus (rat)
Description:P20272
Residue:473
BDBM50006442
NameBDBM50006442
Synonyms:Levonantradol
TypeSmall organic molecule
Emp. Form.C27H35NO4
Mol. Mass.437.5711
SMILES[H][C@@]12CC[C@@H](O)C[C@@]1([H])c1c(N[C@H]2C)cc(O[C@H](C)CCCc2ccccc2)cc1OC(C)=O