Reaction Details
TargetCannabinoid receptor 2
LigandBDBM50234418
Substrate/Competitorn/a
Meas. Tech.ChEMBL_1334664 (CHEMBL3239864)
Ki 3.8±n/a nM
Citation Han, SThatte, JBuzard, DJJones, RM Therapeutic utility of cannabinoid receptor type 2 (CB(2)) selective agonists. Cell Chem Biol56:8224-56 (2013) 
 
Cannabinoid receptor 2
Name:Cannabinoid receptor 2
Type:G Protein-Coupled Receptor (GPCR)
Mol. Mass.:39690.94
Organism:Homo sapiens (Human)
Description:P34972
Residue:360
BDBM50234418
NameBDBM50234418
Synonyms:(2,3-Dichloro-phenyl)-[5-methoxy-2-methyl-3-(2-morpholin-4-yl-ethyl)-indol-1-yl]-methanone CHEMBL73711 L-768242
TypeSmall organic molecule
Emp. Form.C23H24Cl2N2O3
Mol. Mass.447.354
SMILESCOc1ccc2n(C(=O)c3cccc(Cl)c3Cl)c(C)c(CCN3CCOCC3)c2c1