Reaction Details
TargetCannabinoid receptor 2
LigandBDBM50006416
Substrate/Competitorn/a
Meas. Tech.ChEMBL_1334815 (CHEMBL3238922)
Ki 6.8±n/a nM
Citation Han, SThatte, JBuzard, DJJones, RM Therapeutic utility of cannabinoid receptor type 2 (CB(2)) selective agonists. Cell Chem Biol56:8224-56 (2013) 
 
Cannabinoid receptor 2
Name:Cannabinoid receptor 2
Type:G Protein-Coupled Receptor (GPCR)
Mol. Mass.:39690.94
Organism:Homo sapiens (Human)
Description:P34972
Residue:360
BDBM50006416
NameBDBM50006416
Synonyms:CHEMBL3234708
TypeSmall organic molecule
Emp. Form.C24H31NO5
Mol. Mass.413.5066
SMILESCc1c2CCCCn2c(=O)c2cc(OC(=O)C(C)(C)C)cc(OC(=O)C(C)(C)C)c12