Reaction Details
TargetCannabinoid receptor 1
LigandBDBM50005908
Substrate/Competitorn/a
Meas. Tech.ChEMBL_1334812 (CHEMBL3238919)
Ki 7410±n/a nM
Citation Han, SThatte, JBuzard, DJJones, RM Therapeutic utility of cannabinoid receptor type 2 (CB(2)) selective agonists. Cell Chem Biol56:8224-56 (2013) 
 
Cannabinoid receptor 1
Name:Cannabinoid receptor 1
Type:G Protein-Coupled Receptor (GPCR)
Mol. Mass.:52868.96
Organism:Homo sapiens (Human)
Description:P21554
Residue:472
BDBM50005908
NameBDBM50005908
Synonyms:CHEMBL3234707 US9670216, 14 4-Bromo-5-(2-dimethylaminoethylamino)-2-(3,3,5,5-tetramethylcyclohexyl)pyridazin-3-one
TypeSmall organic molecule
Emp. Form.C18H31BrN4O
Mol. Mass.399.369
SMILESCN(C)CCNc1cnn(C2CC(C)(C)CC(C)(C)C2)c(=O)c1Br