Reaction Details
TargetCannabinoid receptor 2
LigandBDBM50006444
Substrate/Competitorn/a
Meas. Tech.ChEMBL_1334801 (CHEMBL3238908)
EC50 9.0±n/a nM
Citation Han, SThatte, JBuzard, DJJones, RM Therapeutic utility of cannabinoid receptor type 2 (CB(2)) selective agonists. Cell Chem Biol56:8224-56 (2013) 
 
Cannabinoid receptor 2
Name:Cannabinoid receptor 2
Type:G Protein-Coupled Receptor (GPCR)
Mol. Mass.:39690.94
Organism:Homo sapiens (Human)
Description:P34972
Residue:360
BDBM50006444
NameBDBM50006444
Synonyms:CHEMBL3233029
TypeSmall organic molecule
Emp. Form.C25H28FN3O2S
Mol. Mass.453.572
SMILESC[C@H](NS(=O)(=O)\C=C\c1n[nH]c2[C@@H](Cc3cccc(F)c3)CCCCc12)c1ccccc1