Reaction Details
TargetCannabinoid receptor 2
LigandBDBM50005917
Substrate/Competitorn/a
Meas. Tech.ChEMBL_1334796 (CHEMBL3238903)
Ki 12±n/a nM
Citation Han, SThatte, JBuzard, DJJones, RM Therapeutic utility of cannabinoid receptor type 2 (CB(2)) selective agonists. Cell Chem Biol56:8224-56 (2013) 
 
Cannabinoid receptor 2
Name:Cannabinoid receptor 2
Type:Enzyme
Mol. Mass.:39366.68
Organism:Rattus norvegicus (Rat)
Description:Q9QZN9
Residue:360
BDBM50005917
NameBDBM50005917
Synonyms:CHEMBL3234681
TypeSmall organic molecule
Emp. Form.C19H21F2N3O
Mol. Mass.345.3863
SMILES[H][C@]12CC[C@]([H])(C1)c1c2c(nn1-c1ccc(F)cc1F)C(=O)NC(C)(C)C