Reaction Details
TargetCannabinoid receptor 1
LigandBDBM50006445
Substrate/Competitorn/a
Meas. Tech.ChEMBL_1334790 (CHEMBL3238897)
EC50>17000±n/a nM
Citation Han, SThatte, JBuzard, DJJones, RM Therapeutic utility of cannabinoid receptor type 2 (CB(2)) selective agonists. Cell Chem Biol56:8224-56 (2013) 
 
Cannabinoid receptor 1
Name:Cannabinoid receptor 1
Type:G Protein-Coupled Receptor (GPCR)
Mol. Mass.:52868.96
Organism:Homo sapiens (Human)
Description:P21554
Residue:472
BDBM50006445
NameBDBM50006445
Synonyms:CHEMBL3234677
TypeSmall organic molecule
Emp. Form.C18H26N4O2
Mol. Mass.330.4246
SMILESCC(NC(=O)c1nc(N2CCOCC2)n2ccccc12)C(C)(C)C