Reaction Details
TargetCannabinoid receptor 1
LigandBDBM50054472
Substrate/Competitorn/a
Meas. Tech.ChEMBL_1334652 (CHEMBL3239852)
Ki 20±n/a nM
Citation Han, SThatte, JBuzard, DJJones, RM Therapeutic utility of cannabinoid receptor type 2 (CB(2)) selective agonists. Cell Chem Biol56:8224-56 (2013) 
 
Cannabinoid receptor 1
Name:Cannabinoid receptor 1
Type:G Protein-Coupled Receptor (GPCR)
Mol. Mass.:52856.55
Organism:Rattus norvegicus (rat)
Description:P20272
Residue:473
BDBM50054472
NameBDBM50054472
Synonyms:(5Z,8Z,11Z,14Z)-Icosa-5,8,11,14-tetraenoic acid ((R)-2-hydroxy-1-methyl-ethyl)-amide CHEMBL120526 | Methanandamide
TypeSmall organic molecule
Emp. Form.C23H39NO2
Mol. Mass.361.5613
SMILESCCCCC\C=C/C\C=C/C\C=C/C\C=C/CCCC(=O)N[C@H](C)CO