Reaction Details
TargetCannabinoid receptor 2
LigandBDBM50006261
Substrate/Competitorn/a
Meas. Tech.ChEMBL_1334791 (CHEMBL3238898)
Ki 27±n/a nM
Citation Han, SThatte, JBuzard, DJJones, RM Therapeutic utility of cannabinoid receptor type 2 (CB(2)) selective agonists. Cell Chem Biol56:8224-56 (2013) 
 
Cannabinoid receptor 2
Name:Cannabinoid receptor 2
Type:G Protein-Coupled Receptor (GPCR)
Mol. Mass.:39690.94
Organism:Homo sapiens (Human)
Description:P34972
Residue:360
BDBM50006261
NameBDBM50006261
Synonyms:CHEMBL3234698
TypeSmall organic molecule
Emp. Form.C25H32F3N3O4
Mol. Mass.495.5345
SMILESCn1c(c\c(=N/C(=O)c2cc(ccc2OCC(C)(C)O)C(F)(F)F)n1C[C@H]1CCCO1)C1(C)CC1