Reaction Details
TargetCannabinoid receptor 2
LigandBDBM50265754
Substrate/Competitorn/a
Meas. Tech.ChEMBL_1334657 (CHEMBL3239857)
Ki 30±n/a nM
Citation Han, SThatte, JBuzard, DJJones, RM Therapeutic utility of cannabinoid receptor type 2 (CB(2)) selective agonists. Cell Chem Biol56:8224-56 (2013) 
 
Cannabinoid receptor 2
Name:Cannabinoid receptor 2
Type:G Protein-Coupled Receptor (GPCR)
Mol. Mass.:39690.94
Organism:Homo sapiens (Human)
Description:P34972
Residue:360
BDBM50265754
NameBDBM50265754
Synonyms:(6-methoxynaphthalen-1-yl)(2-methyl-1-propyl-1H-indol-3-yl)methanone JWH-151
TypeSmall organic molecule
Emp. Form.C24H23NO2
Mol. Mass.357.4449
SMILESCCCn1c(C)c(C(=O)c2cccc3cc(OC)ccc23)c2ccccc12