Reaction Details
TargetCannabinoid receptor 2
LigandBDBM50006449
Substrate/Competitorn/a
Meas. Tech.ChEMBL_1334786 (CHEMBL3238893)
EC50<30±n/a nM
Citation Han, SThatte, JBuzard, DJJones, RM Therapeutic utility of cannabinoid receptor type 2 (CB(2)) selective agonists. Cell Chem Biol56:8224-56 (2013) 
 
Cannabinoid receptor 2
Name:Cannabinoid receptor 2
Type:G Protein-Coupled Receptor (GPCR)
Mol. Mass.:39690.94
Organism:Homo sapiens (Human)
Description:P34972
Residue:360
BDBM50006449
NameBDBM50006449
Synonyms:CHEMBL3234675
TypeSmall organic molecule
Emp. Form.C20H31N5O3S
Mol. Mass.421.557
SMILESCN(C)CCn1c(CC(C)(C)C)nc2cc(ccc12)S(=O)(=O)C1CN(C1)C(N)=O