Reaction Details
TargetCannabinoid receptor 2
LigandBDBM50006250
Substrate/Competitorn/a
Meas. Tech.ChEMBL_1334629 (CHEMBL3239829)
Ki 40±n/a nM
Citation Han, SThatte, JBuzard, DJJones, RM Therapeutic utility of cannabinoid receptor type 2 (CB(2)) selective agonists. Cell Chem Biol56:8224-56 (2013) 
 
Cannabinoid receptor 2
Name:Cannabinoid receptor 2
Type:Enzyme
Mol. Mass.:39366.68
Organism:Rattus norvegicus (Rat)
Description:Q9QZN9
Residue:360
BDBM50006250
NameBDBM50006250
Synonyms:CHEMBL3139186
TypeSmall organic molecule
Emp. Form.C22H27ClN6O
Mol. Mass.426.942
SMILESCN1CCN(CC1)c1nc(C)nc2n(C3CCOCC3)c(nc12)-c1ccccc1Cl