Reaction Details
TargetSigma non-opioid intracellular receptor 1
LigandBDBM50035114
Substrate/Competitorn/a
Meas. Tech.ChEMBL_1334705 (CHEMBL3238652)
Ki 1.3±n/a nM
Citation Mach, RHZeng, CHawkins, WG Thes2 receptor: a novel protein for the imaging and treatment of cancer. J Med Chem56:7137-60 (2013) 
 
Sigma non-opioid intracellular receptor 1
Name:Sigma non-opioid intracellular receptor 1
Type:Enzyme Catalytic Domain
Mol. Mass.:25124.85
Organism:Homo sapiens (Human)
Description:Q99720
Residue:223
BDBM50035114
NameBDBM50035114
Synonyms:1'-[4-(1-methylsulfonyl-1H-3-indolyl)butyl]spiro[1,3-dihydroisobenzofuran-1,4'-(hexahydropyridine)] | CHEMBL64683
TypeSmall organic molecule
Emp. Form.C25H30N2O3S
Mol. Mass.438.582
SMILESCS(=O)(=O)n1cc(CCCCN2CCC3(CC2)OCc2ccccc32)c2ccccc12