Reaction Details
TargetD(3) dopamine receptor
LigandBDBM50137618
Substrate/Competitorn/a
Meas. Tech.ChEMBL_1334696 (CHEMBL3238579)
Ki 627±n/a nM
Citation Mach, RHZeng, CHawkins, WG Thes2 receptor: a novel protein for the imaging and treatment of cancer. J Med Chem56:7137-60 (2013) 
 
D(3) dopamine receptor
Name:D(3) dopamine receptor
Type:n/a
Mol. Mass.:44243.43
Organism:Homo sapiens (Human)
Description:n/a
Residue:400
BDBM50137618
NameBDBM50137618
Synonyms:5-Bromo-N-[4-(6,7-dimethoxy-3,4-dihydro-1H-isoquinolin-2-yl)-butyl]-2,3-dimethoxy-benzamide CHEMBL291439
TypeSmall organic molecule
Emp. Form.C24H31BrN2O5
Mol. Mass.507.417
SMILESCOc1cc2CCN(CCCCNC(=O)c3cc(Br)cc(OC)c3OC)Cc2cc1OC