Reaction Details
TargetSigma non-opioid intracellular receptor 1
LigandBDBM50430266
Substrate/Competitorn/a
Meas. Tech.ChEMBL_1334700 (CHEMBL3238583)
Ki 152±n/a nM
Citation Mach, RHZeng, CHawkins, WG Thes2 receptor: a novel protein for the imaging and treatment of cancer. J Med Chem56:7137-60 (2013) 
 
Sigma non-opioid intracellular receptor 1
Name:Sigma non-opioid intracellular receptor 1
Type:Protein
Mol. Mass.:25307.17
Organism:Cavia porcellus (Guinea pig)
Description:Q60492
Residue:223
BDBM50430266
NameBDBM50430266
Synonyms:CHEMBL2332501
TypeSmall organic molecule
Emp. Form.C18H18FNO
Mol. Mass.283.34
SMILESOC12C3C4C5C3C(C3C5CC4C13)N2Cc1ccc(F)cc1