Reaction Details
TargetSigma non-opioid intracellular receptor 1
LigandBDBM50006608
Substrate/Competitorn/a
Meas. Tech.ChEMBL_1334705 (CHEMBL3238652)
Ki 3063±n/a nM
Citation Mach, RHZeng, CHawkins, WG Thes2 receptor: a novel protein for the imaging and treatment of cancer. J Med Chem56:7137-60 (2013) 
 
Sigma non-opioid intracellular receptor 1
Name:Sigma non-opioid intracellular receptor 1
Type:Enzyme Catalytic Domain
Mol. Mass.:25124.85
Organism:Homo sapiens (Human)
Description:Q99720
Residue:223
BDBM50006608
NameBDBM50006608
Synonyms:CHEMBL3235466
TypeSmall organic molecule
Emp. Form.C22H23NO3
Mol. Mass.349.4229
SMILES[H][C@]12C[C@](CCN1C)(CC(=O)\C2=C\c1cccc(O)c1)c1cccc(O)c1