Reaction Details
TargetSigma non-opioid intracellular receptor 1
LigandBDBM50407213
Substrate/Competitorn/a
Meas. Tech.ChEMBL_1334705 (CHEMBL3238652)
Ki 27±n/a nM
Citation Mach, RHZeng, CHawkins, WG Thes2 receptor: a novel protein for the imaging and treatment of cancer. J Med Chem56:7137-60 (2013) 
 
Sigma non-opioid intracellular receptor 1
Name:Sigma non-opioid intracellular receptor 1
Type:Enzyme Catalytic Domain
Mol. Mass.:25124.85
Organism:Homo sapiens (Human)
Description:Q99720
Residue:223
BDBM50407213
NameBDBM50407213
Synonyms:CHEMBL2111685
TypeSmall organic molecule
Emp. Form.C22H21Cl2NO2
Mol. Mass.402.314
SMILESCN1CC[C@@]2(C[C@H]1C(=Cc1ccc(Cl)c(Cl)c1)C(=O)C2)c1cccc(O)c1