Reaction Details
TargetSigma non-opioid intracellular receptor 1
LigandBDBM50206577
Substrate/Competitorn/a
Meas. Tech.ChEMBL_1334705 (CHEMBL3238652)
Ki 8554±n/a nM
Citation Mach, RHZeng, CHawkins, WG Thes2 receptor: a novel protein for the imaging and treatment of cancer. J Med Chem56:7137-60 (2013) 
 
Sigma non-opioid intracellular receptor 1
Name:Sigma non-opioid intracellular receptor 1
Type:Enzyme Catalytic Domain
Mol. Mass.:25124.85
Organism:Homo sapiens (Human)
Description:Q99720
Residue:223
BDBM50206577
NameBDBM50206577
Synonyms:10-methoxyibogamine IBOGAINE
TypeSmall organic molecule
Emp. Form.C20H26N2O
Mol. Mass.310.4332
SMILESCC[C@H]1C[C@H]2C[C@@H]3[C@H]1N(C2)CCc1c3[nH]c2ccc(OC)cc12