Reaction Details
TargetSigma non-opioid intracellular receptor 1
LigandBDBM50299706
Substrate/Competitorn/a
Meas. Tech.ChEMBL_1334692 (CHEMBL3238575)
Ki 143±n/a nM
Citation Mach, RHZeng, CHawkins, WG Thes2 receptor: a novel protein for the imaging and treatment of cancer. J Med Chem56:7137-60 (2013) 
 
Sigma non-opioid intracellular receptor 1
Name:Sigma non-opioid intracellular receptor 1
Type:Protein
Mol. Mass.:25307.17
Organism:Cavia porcellus (Guinea pig)
Description:Q60492
Residue:223
BDBM50299706
NameBDBM50299706
Synonyms:4-Cyclohexyl-1-[3-(5-methoxy-1,2,3,4-tetrahydronaphthalen-1-yl-propyl)]piperidine | CHEMBL583580
TypeSmall organic molecule
Emp. Form.C25H39NO
Mol. Mass.369.5833
SMILESCOc1cccc2C(CCCN3CCC(CC3)C3CCCCC3)CCCc12