Reaction Details
TargetNeuronal acetylcholine receptor subunit alpha-7
LigandBDBM50006621
Substrate/Competitorn/a
Meas. Tech.ChEMBL_1335296 (CHEMBL3238720)
Ki 0.930000±n/a nM
Citation Gao, YKellar, KJYasuda, RPTran, TXiao, YDannals, RFHorti, AG Derivatives of dibenzothiophene for positron emission tomography imaging ofa7-nicotinic acetylcholine receptors. J Med Chem56:7574-89 (2013) 
 
Neuronal acetylcholine receptor subunit alpha-7
Name:Neuronal acetylcholine receptor subunit alpha-7
Type:Enzyme
Mol. Mass.:56502.44
Organism:Rattus norvegicus (Rat)
Description:Q05941
Residue:502
BDBM50006621
NameBDBM50006621
Synonyms:CHEMBL3235487
TypeSmall organic molecule
Emp. Form.C19H19IN2O2S
Mol. Mass.466.336
SMILESIc1cccc2-c3ccc(cc3S(=O)(=O)c12)N1CCN2CCC1CC2