Reaction Details
TargetAcetylcholine receptor subunit alpha/Neuronal acetylcholine receptor subunit beta-2
LigandBDBM50006616
Substrate/Competitorn/a
Meas. Tech.ChEMBL_1335284 (CHEMBL3238708)
Ki>10000±n/a nM
Citation Gao, YKellar, KJYasuda, RPTran, TXiao, YDannals, RFHorti, AG Derivatives of dibenzothiophene for positron emission tomography imaging ofa7-nicotinic acetylcholine receptors. J Med Chem56:7574-89 (2013) 
 
Acetylcholine receptor subunit alpha/Neuronal acetylcholine receptor subunit beta-2
Name:Acetylcholine receptor subunit alpha/Neuronal acetylcholine receptor subunit beta-2
Synonyms:Nicotinic acetylcholine receptor alpha2/beta2
Type:n/a
Mol. Mass.:n/a
Description:ASSAY_ID of ChEMBL is 964980
Components:This complex has 2 components.
Component 1
Name:Acetylcholine receptor subunit alpha
Type:Ion channel
Mol. Mass.:54542.01
Organism:Homo sapiens (Human)
Description:n/a
Residue:482
Component 2
Name:Neuronal acetylcholine receptor subunit beta-2
Synonyms:ACHB2_HUMAN Neuronal acetylcholine receptor protein beta-2 subunit | Nicotinic acetylcholine receptor alpha3/beta2/alpha5
Type:Protein
Mol. Mass.:57020.50
Organism:Homo sapiens (Human)
Description:P17787
Residue:502
BDBM50006616
NameBDBM50006616
Synonyms:CHEMBL3235484
TypeSmall organic molecule
Emp. Form.C19H19FN2O2S
Mol. Mass.358.43
SMILESFc1ccc(N2CCN3CCC2CC3)c2-c3ccccc3S(=O)(=O)c12